[Ci-reports] [Qt CI] fail on ssh://codereview.qt-project.org:29418/qt/qt5#master

Qt Continuous Integration System ci-noreply at qt-project.org
Wed Oct 17 16:12:15 CEST 2012


`make' failed :(

  make[2]: *** [sub-browser-make_first] Error 3
  make[3]: *** [sub-wheel-make_first] Error 3
  make[3]: *** [sub-domtraversal-make_first] Error 3
  make[3]: *** [sub-plot-make_first] Error 3
  make[2]: *** [sub-scroller-make_first] Error 2
  make[3]: *** [sub-qobjectxmlmodel-make_first] Error 3
  make[2]: *** [sub-xmlpatterns-make_first] Error 2
  make[3]: *** [sub-formextractor-make_first] Error 3
  make[3]: *** [sub-imageanalyzer-make_first] Error 3
  make[3]: *** [sub-framecapture-make_first] Error 3
  make[3]: *** [sub-fancybrowser-make_first] Error 3
  make[3]: *** [sub-googlechat-make_first] Error 3
  make[3]: *** [sub-previewer-make_first] Error 3
  make[3]: *** [sub-simpleselector-make_first] Error 3
  make[2]: *** [sub-webkit-make_first] Error 2
  make[3]: *** [sub-anomaly-make_first] Error 3
  make[2]: *** [sub-embedded-make_first] Error 2
  make[1]: *** [sub-examples-make_first] Error 2
  make: *** [module-qtwebkit-examples-and-demos-make_first] Error 2

  Build log: http://testresults.qt-project.org/ci/Qt5_master_Integration/build_01012/linux-g++-32_developer-build_Ubuntu_10.04_x86/log.txt.gz

  Tested changes (refs/builds/master_1350480253):
    http://codereview.qt-project.org/37254 [PS5] - Updated submodules.



More information about the Ci-reports mailing list