[Ci-reports] fail on ssh://codereview.qt-project.org:29418/qt/qtmacextras#dev

Qt Continuous Integration System ci-noreply at qt-project.org
Mon Jul 1 11:32:00 CEST 2013


qtmacextras failed to compile :(

  /Applications/Xcode.app/Contents/Developer/Platforms/MacOSX.platform/Developer/SDKs/MacOSX10.8.sdk/System/Library/Frameworks/ApplicationServices.framework/Frameworks/ColorSync.framework/Headers/ColorSyncDeprecated.h:1002:41: note: 'CMProfileRef' declared here
  /Applications/Xcode.app/Contents/Developer/Platforms/MacOSX.platform/Developer/SDKs/MacOSX10.8.sdk/System/Library/Frameworks/ApplicationServices.framework/Frameworks/ColorSync.framework/Headers/ColorSyncDeprecated.h:999:41: note: 'CMError' declared here
  /Applications/Xcode.app/Contents/Developer/Platforms/MacOSX.platform/Developer/SDKs/MacOSX10.8.sdk/System/Library/Frameworks/ApplicationServices.framework/Frameworks/ColorSync.framework/Headers/ColorSyncDeprecated.h:1972:1: note: 'CMCloseProfile' declared here
  In file included from qmacnativetoolbar.mm:44:
  ./qmactoolbardelegate.h:84:50: error: interface type 'QMacToolbarDelegate' cannot be passed by value; did you forget * in 'QMacToolbarDelegate'
  ./qmactoolbardelegate.h:84:1: error: C++ requires a type specifier for all declarations
  In file included from qmacnativetoolbar.mm:45:
  ./qnstoolbar.h:60:42: error: interface type 'QtNSToolbar' cannot be passed by value; did you forget * in 'QtNSToolbar'
  ./qnstoolbar.h:60:1: error: C++ requires a type specifier for all declarations
  qmacnativetoolbar.mm:130:49: error: interface type 'QNSToolbarNotifier' cannot be passed by value; did you forget * in 'QNSToolbarNotifier'
  qmacnativetoolbar.mm:130:1: error: C++ requires a type specifier for all declarations
  In file included from qmactoolbardelegate.mm:43:
  ./qmactoolbardelegate.h:84:50: error: interface type 'QMacToolbarDelegate' cannot be passed by value; did you forget * in 'QMacToolbarDelegate'
  ./qmactoolbardelegate.h:84:1: error: C++ requires a type specifier for all declarations
  make[3]: *** [.obj/debug-shared/qmactoolbardelegate.o] Error 1
  make[3]: *** [.obj/debug-shared/qmacnativetoolbar.o] Error 1
  make[2]: *** [sub-macextras-make_first] Error 2
  make[1]: *** [sub-src-make_first] Error 2
  make: *** [module-qtmacextras] Error 2

  Build log: http://testresults.qt-project.org/ci/QtMacExtras_dev_Integration/build_00002/macx-clang_no-framework_OSX_10.8/log.txt.gz

  Tested changes (refs/builds/dev_1372670723):
    http://codereview.qt-project.org/60129 [PS1] - Support namespaced build



More information about the Ci-reports mailing list