[Ci-reports] fail on QtQuickControls_dev_Integration #418

Qt Continuous Integration System ci-noreply at qt-project.org
Fri Aug 22 11:32:59 CEST 2014


qtdeclarative failed to compile :(

  {standard input}: Assembler messages:
  {standard input}:26547: Error: expected comma after "_ZL30__gthrw_pth"
  make[3]: *** [.obj/qquicktextedit.o] Error 4
  {standard input}: Assembler messages:
  {standard input}:22121: Error: unknown pseudo-op: `.lbe931'
  make[3]: *** [.obj/qquickgridview.o] Error 4
  make[3]: *** [.obj/qquickpathview.o] Error 4
  make[2]: *** [sub-quick-make_first-ordered] Error 2
  make[1]: *** [sub-src-make_first] Error 2
  make: *** [module-qtdeclarative] Error 2

  Build log: http://testresults.qt-project.org/ci/QtQuickControls_dev_Integration/build_00418/linux-g++_no-widgets_Ubuntu_12.04_x64/log.txt.gz

  Tested changes (refs/builds/dev_1408692703):
    http://codereview.qt-project.org/92723 [PS2] - QtQuick.Controls TextField: add remove() function



More information about the Ci-reports mailing list