[Ci-reports] fail on QtWayland_dev_Integration #26

Qt Continuous Integration System ci-noreply at qt-project.org
Mon May 12 12:32:03 CEST 2014


qtwayland failed to compile :(

  ../../../../hardwareintegration/client/xcomposite-egl/qwaylandxcompositeeglcontext.cpp: In constructor ‘QWaylandXCompositeEGLContext::QWaylandXCompositeEGLContext(const QSurfaceFormat&, QPlatformOpenGLContext*, EGLDisplay)’:
  ../../../../hardwareintegration/client/xcomposite-egl/qwaylandxcompositeeglcontext.cpp:54:127: error: lvalue required as unary ‘&’ operand
  make[6]: *** [.obj/qwaylandxcompositeeglcontext.o] Error 1
  make[5]: *** [sub-xcomposite-egl-make_first] Error 2
  make[4]: *** [sub-client-make_first] Error 2
  make[3]: *** [sub-hardwareintegration-make_first] Error 2
  ../../../hardwareintegration/client/xcomposite-egl/qwaylandxcompositeeglcontext.cpp: In constructor ‘QWaylandXCompositeEGLContext::QWaylandXCompositeEGLContext(const QSurfaceFormat&, QPlatformOpenGLContext*, EGLDisplay)’:
  ../../../hardwareintegration/client/xcomposite-egl/qwaylandxcompositeeglcontext.cpp:54:127: error: lvalue required as unary ‘&’ operand
  make[5]: *** [.obj/qwaylandxcompositeeglcontext.o] Error 1
  make[4]: *** [sub-qwayland-xcomposite-egl-make_first-ordered] Error 2
  make[3]: *** [sub-platforms-make_first] Error 2
  make[2]: *** [sub-plugins-make_first-ordered] Error 2
  make[1]: *** [sub-src-make_first] Error 2
  make: *** [module-qtwayland] Error 2

  Build log: http://testresults.qt-project.org/ci/QtWayland_dev_Integration/build_00026/linux-g++_developer-build_OpenSuSE_13.1_x64/log.txt.gz

  Tested changes (refs/builds/dev_1399889705):
    http://codereview.qt-project.org/85120 [PS1] - Fix resizing of shm apps
    http://codereview.qt-project.org/85157 [PS1] - Fix build after QEGLPlatformContext API change



More information about the Ci-reports mailing list