[Ci-reports] fail on QtBase_5.5_Integration #1777

Qt Continuous Integration System ci-noreply at qt-project.org
Fri Jul 31 14:48:05 CEST 2015


qtbase failed to compile :(

                   from ../../../../../include/QtTest/QtTest:7,
                   from /work/build/qt/qtbase/tests/auto/widgets/graphicsview/qgraphicsview/tst_qgraphicsview.cpp:35:
  /work/build/qt/qtbase/tests/auto/widgets/graphicsview/qgraphicsview/tst_qgraphicsview.cpp: In member function ‘void tst_QGraphicsView::update()’:
  /work/build/qt/qtbase/tests/auto/widgets/graphicsview/qgraphicsview/tst_qgraphicsview.cpp:4048:19: warning: variable ‘updateRect’ set but not used [-Wunused-but-set-variable]
  ../../../../../include/QtTest/../../../../../../work/build/qt/qtbase/src/testlib/qtestcase.h:192:10: note: in definition of macro ‘QFETCH’
  In file included from ../../../../../include/QtTest/qtestcase.h:1:0,
                   from ../../../../../include/QtTest/../../../../../../work/build/qt/qtbase/src/testlib/qtest.h:38,
                   from ../../../../../include/QtTest/qtest.h:1,
                   from ../../../../../include/QtTest/QtTest:7,
                   from /work/build/qt/qtbase/tests/auto/widgets/itemviews/qtreeview/tst_qtreeview.cpp:36:
  ../../../../../include/QtTest/../../../../../../work/build/qt/qtbase/src/testlib/qtestcase.h:192:10: note: in definition of macro ‘QFETCH’
  /work/build/qt/qtbase/tests/auto/widgets/graphicsview/qgraphicsview/tst_qgraphicsview.cpp: In member function ‘void tst_QGraphicsView::mouseTracking3()’:
  /work/build/qt/qtbase/tests/auto/widgets/graphicsview/qgraphicsview/tst_qgraphicsview.cpp:3829:6: internal compiler error: Segmentation fault
  make[6]: *** [.obj/tst_qgraphicsview.o] Error 1
  make[5]: *** [sub-qgraphicsview-make_first] Error 2
  make[4]: *** [sub-graphicsview-make_first] Error 2
  make[3]: *** [sub-widgets-make_first] Error 2
  make[2]: *** [sub-auto-make_first] Error 2
  make[1]: *** [sub-tests-make_first] Error 2
  make: *** [module-qtbase] Error 2

  Build log: http://testresults.qt.io/ci/QtBase_5.5_Integration/build_01777/linux-g++_shadow-build_Ubuntu_14.04_x64/log.txt.gz

  Tested changes (refs/builds/5.5_1438344621):
    http://codereview.qt-project.org/122194 [PS1] - Fix for build with -qreal float
    http://codereview.qt-project.org/122368 [PS4] - Fix a memory leak



More information about the Ci-reports mailing list