[Development] Vsd: Change in qt/qtdeclarative[stable]: Some minor optimizations

Hausmann Simon Simon.Hausmann at digia.com
Thu Oct 17 21:09:06 CEST 2013


https://codereview.qt-project.org/#change,68500‎ should fix that particular issue :). But the original issue is new :/


Simon
Fra: Sergio Ahumada
Sendt: 21:07 torsdag 17. oktober 2013
Til: development at qt-project.org
Emne: Re: [Development] Vsd: Change in qt/qtdeclarative[stable]: Some minor optimizations


El 17/10/13 20:40, Hausmann Simon escribió:
>
> Hi,
>
> Qtdeclarative stopped integrating due to a qtbase change. Does the below
> error message ring a bell for anyone?

while we are it .. it seems like static builds are broken as well

https://codereview.qt-project.org/68434


cd qmlbundle/ && ( test -e Makefile || /work/build/qtbase/bin/qmake
/work/build/qtdeclarative/tools/qmlbundle/qmlbundle.pro -o Makefile ) &&
make -f Makefile
Project ERROR: qmlimportscanner is missing. Rebuild
qtdeclarative/tools/qmlimportscanner.
Project ERROR: qmlimportscanner is missing. Rebuild
qtdeclarative/tools/qmlimportscanner.
make[2]: *** [sub-qmlplugindump-make_first] Error 3
make[2]: *** Waiting for unfinished jobs....
make[2]: *** [sub-qmlscene-make_first] Error 3
Project ERROR: qmlimportscanner is missing. Rebuild
qtdeclarative/tools/qmlimportscanner.
make[2]: *** [sub-qmltestrunner-make_first] Error 3
Project ERROR: qmlimportscanner is missing. Rebuild
qtdeclarative/tools/qmlimportscanner.
make[2]: *** [sub-qmlprofiler-make_first] Error 3
Project ERROR: qmlimportscanner is missing. Rebuild
qtdeclarative/tools/qmlimportscanner.
make[2]: *** [sub-qml-make_first] Error 3
make[3]: Entering directory `/work/build/qtdeclarative/tools/qmlmin'
compiling main.cpp
make[3]: Entering directory `/work/build/qtdeclarative/tools/qmlbundle'
compiling main.cpp
linking /work/build/qtbase/bin/qmlbundle
linking /work/build/qtbase/bin/qmlmin
make[3]: Leaving directory `/work/build/qtdeclarative/tools/qmlbundle'
make[3]: Leaving directory `/work/build/qtdeclarative/tools/qmlmin'
make[2]: Leaving directory `/work/build/qtdeclarative/tools'
make[1]: *** [sub-tools-make_first] Error 2
make[1]: Leaving directory `/work/build/qtdeclarative'
make: *** [module-qtdeclarative-make_first] Error 2

_______________________________________________
Development mailing list
Development at qt-project.org
http://lists.qt-project.org/mailman/listinfo/development
-------------- next part --------------
An HTML attachment was scrubbed...
URL: <http://lists.qt-project.org/pipermail/development/attachments/20131017/c5fad8ec/attachment.html>


More information about the Development mailing list